BDBM93938 MLS003121441::N-[2-ethyl-8-[4-(trifluoromethyl)benzyl]oxy-imidazo[1,2-a]pyridin-3-yl]-N-methyl-isonicotinamide::N-[2-ethyl-8-[[4-(trifluoromethyl)phenyl]methoxy]-3-imidazo[1,2-a]pyridinyl]-N-methyl-4-pyridinecarboxamide::N-[2-ethyl-8-[[4-(trifluoromethyl)phenyl]methoxy]imidazo[1,2-a]pyridin-3-yl]-N-methyl-pyridine-4-carboxamide::N-[2-ethyl-8-[[4-(trifluoromethyl)phenyl]methoxy]imidazo[1,2-a]pyridin-3-yl]-N-methylpyridine-4-carboxamide::SMR001284219::cid_46948337
SMILES CCc1nc2c(OCc3ccc(cc3)C(F)(F)F)cccn2c1N(C)C(=O)c1ccncc1
InChI Key InChIKey=IKJFCQSUXYLNRY-UHFFFAOYSA-N
Data  2 IC50
  Tab Delimited (TSV)   2D SDfile   Computed 3D by Vconf -m prep SDfile
Find this compound or compounds like it in BindingDB:
Activity Spreadsheet -- Enzyme Inhibition Constant Data from BindingDB
Found 2 hits for monomerid = 93938
TargetHeat shock protein hsp-16.2(Caenorhabditis elegans)
Burnham Center For Chemical Genomics
Curated by PubChem BioAssay
LigandPNGBDBM93938(MLS003121441 | N-[2-ethyl-8-[4-(trifluoromethyl)be...)
Affinity DataIC50:  4.99E+4nM
Ligand InfoPC cidPC sid
In DepthDetails PCBioAssay
TargetProtein skinhead-1(Caenorhabditis elegans)
Burnham Center For Chemical Genomics
Curated by PubChem BioAssay
LigandPNGBDBM93938(MLS003121441 | N-[2-ethyl-8-[4-(trifluoromethyl)be...)
Affinity DataIC50:  3.57E+3nM
Ligand InfoPC cidPC sid
In DepthDetails PCBioAssay