BDBM97625 US8470843, 1
SMILES OC1CN(Cc2ccccc2)CCC11CCN(C1=O)c1ccc(OC(F)(F)F)cc1
InChI Key InChIKey=XGZOQJBQECHXJE-UHFFFAOYSA-N
Data  1 IC50
  Tab Delimited (TSV)   2D SDfile   Computed 3D by Vconf -m prep SDfile
Find this compound or compounds like it in BindingDB:
Activity Spreadsheet -- Enzyme Inhibition Constant Data from BindingDB
Found 1 hit for monomerid = 97625
TargetHormone-sensitive lipase(Homo sapiens (Human))
Hoffmann-La Roche
US Patent
LigandPNGBDBM97625(US8470843, 1)
Affinity DataIC50:  60nMpH: 7.2 T: 2°C. Assay description: HSL enzyme activity was measured by a colorimetric assay using 2,3-dimercapto-1-propanol tributyrate (Aldrich, St. Louis, MO) as a substrate.
In DepthDetails US Patent