BDBM97634 US8470843, 10
SMILES CC(Oc1ccc(cc1)N1CCC2(CCN(CC2O)S(=O)(=O)c2ccccc2Cl)C1=O)C(F)(F)F
InChI Key InChIKey=ZVJNBRHLPLFITE-UHFFFAOYSA-N
Data  1 IC50
  Tab Delimited (TSV)   2D SDfile   Computed 3D by Vconf -m prep SDfile
Find this compound or compounds like it in BindingDB:
Activity Spreadsheet -- Enzyme Inhibition Constant Data from BindingDB
Found 1 hit for monomerid = 97634
TargetHormone-sensitive lipase(Homo sapiens (Human))
Hoffmann-La Roche
US Patent
LigandPNGBDBM97634(US8470843, 10)
Affinity DataIC50:  20nMpH: 7.2 T: 2°C. Assay description: HSL enzyme activity was measured by a colorimetric assay using 2,3-dimercapto-1-propanol tributyrate (Aldrich, St. Louis, MO) as a substrate.
In DepthDetails US Patent