BDBM98860 US8487093, 6
SMILES OS(=O)(=O)ON1C2CN([C@@H](CC2)C(=O)Nc2ccncc2)C1=O
InChI Key InChIKey=KAHIJDGZACVJPS-AXDSSHIGSA-N
Data  2 IC50
  Tab Delimited (TSV)   2D SDfile   Computed 3D by Vconf -m prep SDfile
Find this compound or compounds like it in BindingDB:
Activity Spreadsheet -- Enzyme Inhibition Constant Data from BindingDB
Found 2 hits for monomerid = 98860
TargetBeta-lactamase(Klebsiella pneumoniae)
Merck Sharp & Dohme
US Patent
LigandPNGBDBM98860(US8487093, 6)
Affinity DataIC50:  54nM. Assay description: Enzyme activities were measured in the presence of the test inhibitor in spectrophotometric assay.
In DepthDetails US Patent
TargetBeta-lactamase(Pseudomonas aeruginosa)
Merck Sharp & Dohme
US Patent
LigandPNGBDBM98860(US8487093, 6)
Affinity DataIC50:  6nM. Assay description: Enzyme activities were measured in the presence of the test inhibitor in spectrophotometric assay.
In DepthDetails US Patent