Target
DNA damage-binding protein 1/Protein cereblon
Ligand
BDBM65454
Substrate
Meas. Tech.
Fluorescence thermal melt assay
pH
8±n/a
Temperature
343.15±n/a K
IC50
3000±0 nM
Comments
extracted
Citation
 Lopez-Girona, AMendy, DIto, TMiller, KGandhi, AKKang, JKarasawa, SCarmel, GJackson, PAbbasian, MMahmoudi, ACathers, BRychak, EGaidarova, SChen, RSchafer, PHHanda, HDaniel, TOEvans, JFChopra, R Cereblon is a direct protein target for immunomodulatory and antiproliferative activities of lenalidomide and pomalidomide. Leukemia 26:2326-35 (2012)  
Target
Name:
DNA damage-binding protein 1/Protein cereblon
Synonyms:
CRBN-DDB1 Cereblon_DDB1 | Protein cereblon/DNA damage-binding protein 1
Type:
Enzyme
Mol. Mass.:
Description:
Components:
This complex has 2 components.
Component 1
Name:
DNA damage-binding protein 1
Synonyms:
DDB p127 subunit DDB1_HUMAN DNA damage-binding protein a HBV X-associated protein 1 UV-damaged DNA-binding factor XAP-1 XPCe XPE-binding factor | Xeroderma pigmentosum group E-complementing protein
Type:
Protein
Mol. Mass.:
126936.22
Organism:
Homo sapiens (Human)
Description:
Q16531
Residue:
1140
  
Component 2
Name:
Protein cereblon
Synonyms:
CRBN | CRBN_HUMAN
Type:
PROTEIN
Mol. Mass.:
50537.73
Organism:
Homo sapiens (Human)
Description:
ChEMBL_116917
Residue:
442
  
Inhibitor
Name:
BDBM65454
Synonyms:
191732-72-6 Lenalidomide Revlimid US9694015, 6.1
Type:
Small organic molecule
Emp. Form.:
C13H13N3O3
Mol. Mass.:
259.2606
SMILES:
Nc1cccc2C(=O)N(Cc12)C1CCC(=O)NC1=O
: