Target
Tyrosine-protein kinase JAK1
Ligand
BDBM246861
Substrate
Meas. Tech.
Alphascreen Assay
IC50
<10±n/a nM
Citation
 Qiao, LWeng, LMeloni, DJia, ZWang, JZhou, J Salts and processes of preparing a PI3K inhibitor US Patent  US11084822 Publication Date 8/10/2021 
Target
Name:
Tyrosine-protein kinase JAK1
Synonyms:
JAK-1 JAK1A JAK1_HUMAN Janus kinase 1 (JAK1) | Janus kinase 1 JAK1
Type:
Protein
Mol. Mass.:
133293.73
Organism:
Homo sapiens (Human)
Description:
P23458
Residue:
1154
  
Inhibitor
Name:
BDBM246861
Synonyms:
3-[1-(6- chloropyridin-2- yl)pyrrolidin-3-yl]-3- [4-(7H-pyrrolo[2,3- d]pyrimidin-4-yl)- 1H-pyrazol-1- yl]propanenitrile US10053465, 3 US10125150, Example 3 US10479803, Example 3 US10675284, Example 3 US11130767, # 3 US11304949, Compound 6 US11406640, Comp. No. 6 US20240058343, Compound 6 | US9732097, Example 3
Type:
Small organic molecule
Emp. Form.:
C21H19ClN8
Mol. Mass.:
418.882
SMILES:
Clc1cccc(n1)N1CCC(C1)C(CC#N)n1cc(cn1)-c1ncnc2[nH]ccc12
: