Target
Tyrosine-protein kinase JAK1
Ligand
BDBM246866
Substrate
Meas. Tech.
Alphascreen Assay
IC50
<10±n/a nM
Citation
 Qiao, LWeng, LMeloni, DJia, ZWang, JZhou, J Salts and processes of preparing a PI3K inhibitor US Patent  US11084822 Publication Date 8/10/2021 
Target
Name:
Tyrosine-protein kinase JAK1
Synonyms:
JAK-1 JAK1A JAK1_HUMAN Janus kinase 1 (JAK1) | Janus kinase 1 JAK1
Type:
Protein
Mol. Mass.:
133293.73
Organism:
Homo sapiens (Human)
Description:
P23458
Residue:
1154
  
Inhibitor
Name:
BDBM246866
Synonyms:
4-[(4-{3-cyano-2-[4- (7H-pyrrolo[2,3- d]pyrimidin-4-yl)- 1H-pyrazol-1- yl]propyl}piperazin- 1-yl)carbonyl]-3- fluorobenzonitrile US10065963, Compound 5 US11084822, Example 5
Type:
Small organic molecule
Emp. Form.:
C25H22FN9O
Mol. Mass.:
483.5003
SMILES:
Fc1cc(ccc1C(=O)N1CCN(CC(CC#N)n2cc(cn2)-c2ncnc3[nH]ccc23)CC1)[N+]#[C-]
: