Target
Tyrosine-protein kinase JAK1
Ligand
BDBM246867
Substrate
Meas. Tech.
Alphascreen Assay
IC50
<10±n/a nM
Citation
 Qiao, LWeng, LMeloni, DJia, ZWang, JZhou, J Salts and processes of preparing a PI3K inhibitor US Patent  US11084822 Publication Date 8/10/2021 
Target
Name:
Tyrosine-protein kinase JAK1
Synonyms:
JAK-1 JAK1A JAK1_HUMAN Janus kinase 1 (JAK1) | Janus kinase 1 JAK1
Type:
Protein
Mol. Mass.:
133293.73
Organism:
Homo sapiens (Human)
Description:
P23458
Residue:
1154
  
Inhibitor
Name:
BDBM246867
Synonyms:
4-[(4-{3-cyano-2-[3- (7H-pyrrolo[2,3- d]pyrimidin-4-yl)- 1H-pyrrol-1- yl]propyl}piperazin- 1-yl)carbonyl]-3- fluorobenzonitrile US10065963, Compound 6 US10336759, # 6 US10519163, Example 6 US11084822, Example 6 US11136326, Example 6 US11324749, Comp. No. 9 US11596632, Comp. No. 9 US9732097, Example 6
Type:
Small organic molecule
Emp. Form.:
C26H23FN8O
Mol. Mass.:
482.5122
SMILES:
Fc1cc(ccc1C(=O)N1CCN(CC(CC#N)n2ccc(c2)-c2ncnc3[nH]ccc23)CC1)C#N
: