Target
Tyrosine-protein kinase JAK1
Ligand
BDBM246869
Substrate
Meas. Tech.
Alphascreen Assay
IC50
<10±n/a nM
Citation
 Qiao, LWeng, LMeloni, DJia, ZWang, JZhou, J Salts and processes of preparing a PI3K inhibitor US Patent  US11084822 Publication Date 8/10/2021 
Target
Name:
Tyrosine-protein kinase JAK1
Synonyms:
JAK-1 JAK1A JAK1_HUMAN Janus kinase 1 (JAK1) | Janus kinase 1 JAK1
Type:
Protein
Mol. Mass.:
133293.73
Organism:
Homo sapiens (Human)
Description:
P23458
Residue:
1154
  
Inhibitor
Name:
BDBM246869
Synonyms:
4-{3-(Cyanomethyl)- 3-[4-(7H-pyrrolo[2,3- d]pyrimidin-4-yl)- 1H-pyrazol-1- yl]azetidin-1-yl}-N- [4-fluoro-2- (trifluoromethyl) phenyl]piperidine-1- carboxamide US10065963, Compound 8 US10336759, # 8 US10519163, Example 8 US11084822, Example 8 US11136326, Example 8 US11304949, Compound 2 US11406640, Comp. No. 2 US20240058343, Compound 2 US9999619, Example 154
Type:
Small organic molecule
Emp. Form.:
C27H25F4N9O
Mol. Mass.:
567.5407
SMILES:
Fc1ccc(NC(=O)N2CCC(CC2)N2CC(CC#N)(C2)n2cc(cn2)-c2ncnc3[nH]ccc23)c(c1)C(F)(F)F
: