Target
Tyrosine-protein kinase JAK1
Ligand
BDBM246871
Substrate
Meas. Tech.
Alphascreen Assay
IC50
<10±n/a nM
Citation
 Qiao, LWeng, LMeloni, DJia, ZWang, JZhou, J Salts and processes of preparing a PI3K inhibitor US Patent  US11084822 Publication Date 8/10/2021 
Target
Name:
Tyrosine-protein kinase JAK1
Synonyms:
JAK-1 JAK1A JAK1_HUMAN Janus kinase 1 (JAK1) | Janus kinase 1 JAK1
Type:
Protein
Mol. Mass.:
133293.73
Organism:
Homo sapiens (Human)
Description:
P23458
Residue:
1154
  
Inhibitor
Name:
BDBM246871
Synonyms:
US10053465, 10 US10125150, Example 10 US10479803, Example 10 US10675284, Example 10 US11130767, # 10 US11304949, Compound 10 US11406640, Comp. No. 10 US20240058343, Compound 10 [trans-1-[4-(7H- pyrrolo[2,3- d]pyrimidin-4-yl)- 1H-pyrazol-1-yl]-3- (4-{[2- (trifluoromethyl) pyrimidin-4- yl]carbonyl} piperazin-1- yl)cyclobutyl] acetonitrile
Type:
Small organic molecule
Emp. Form.:
C25H23F3N10O
Mol. Mass.:
536.5117
SMILES:
FC(F)(F)c1nccc(n1)C(=O)N1CCN(CC1)[C@H]1C[C@@](CC#N)(C1)n1cc(cn1)-c1ncnc2[nH]ccc12
: