Target
Tyrosine-protein kinase JAK1
Ligand
BDBM246876
Substrate
Meas. Tech.
Alphascreen Assay
IC50
<10±n/a nM
Citation
 Qiao, LWeng, LMeloni, DJia, ZWang, JZhou, J Salts and processes of preparing a PI3K inhibitor US Patent  US11084822 Publication Date 8/10/2021 
Target
Name:
Tyrosine-protein kinase JAK1
Synonyms:
JAK-1 JAK1A JAK1_HUMAN Janus kinase 1 (JAK1) | Janus kinase 1 JAK1
Type:
Protein
Mol. Mass.:
133293.73
Organism:
Homo sapiens (Human)
Description:
P23458
Residue:
1154
  
Inhibitor
Name:
BDBM246876
Synonyms:
5-{3-(cyanomethyl)- 3-[4-(7H-pyrrolo[2,3- d]pyrimidin-4-yl)- 1H-pyrazol-1- yl]azetidin-1-yl}-N- isopropylpyrazine-2- carboxamide US10053465, 17 US10125150, Example 15 US10479803, Example 15 US10675284, Example 15 US11130767, # 15 US11214573, Example 18 US11324749, Comp. No. 15 US20240058343, Compound 15 US9732097, Example 15
Type:
Small organic molecule
Emp. Form.:
C22H22N10O
Mol. Mass.:
442.4765
SMILES:
CC(C)NC(=O)c1cnc(cn1)N1CC(CC#N)(C1)n1cc(cn1)-c1ncnc2[nH]ccc12
: