Target
Tyrosine-protein kinase JAK1
Ligand
BDBM246877
Substrate
Meas. Tech.
Alphascreen Assay
IC50
<10±n/a nM
Citation
 Qiao, LWeng, LMeloni, DJia, ZWang, JZhou, J Salts and processes of preparing a PI3K inhibitor US Patent  US11084822 Publication Date 8/10/2021 
Target
Name:
Tyrosine-protein kinase JAK1
Synonyms:
JAK-1 JAK1A JAK1_HUMAN Janus kinase 1 (JAK1) | Janus kinase 1 JAK1
Type:
Protein
Mol. Mass.:
133293.73
Organism:
Homo sapiens (Human)
Description:
P23458
Residue:
1154
  
Inhibitor
Name:
BDBM246877
Synonyms:
4-{3-(cyanomethyl)- 3-[4-(7H-pyrrolo[2,3- d]pyrimidin-4-yl)- 1H-pyrazol-1- yl]azetidin-1-yl}-2,5- difluoro-N-[(1S)- 2,2,2-trifluoro-1- methylethyl] benzamide US10065963, Compound 16 US10336759, # 16 US10519163, Example 16 US11084822, Example 16 US11136326, Example 16 US11304949, Compound 16 US11406640, Comp. No. 16 US9611269, Example 28 | US9732097, Example 16
Type:
Small organic molecule
Emp. Form.:
C24H19F5N8O
Mol. Mass.:
530.4527
SMILES:
C[C@H](NC(=O)c1cc(F)c(cc1F)N1CC(CC#N)(C1)n1cc(cn1)-c1ncnc2[nH]ccc12)C(F)(F)F
: