Target
Tyrosine-protein kinase JAK1
Ligand
BDBM246881
Substrate
Meas. Tech.
Alphascreen Assay
IC50
<10±n/a nM
Citation
 Qiao, LWeng, LMeloni, DJia, ZWang, JZhou, J Salts and processes of preparing a PI3K inhibitor US Patent  US11084822 Publication Date 8/10/2021 
Target
Name:
Tyrosine-protein kinase JAK1
Synonyms:
JAK-1 JAK1A JAK1_HUMAN Janus kinase 1 (JAK1) | Janus kinase 1 JAK1
Type:
Protein
Mol. Mass.:
133293.73
Organism:
Homo sapiens (Human)
Description:
P23458
Residue:
1154
  
Inhibitor
Name:
BDBM246881
Synonyms:
US10053465, 20 US10125150, Example 20 US10479803, Example 20 US10675284, Example 20 US11130767, # 20 US11304949, Compound 20 US11406640, Comp. No. 20 US20240058343, Compound 20 | {1-(cis-4-{[4-(1- hydroxy-1- methylethyl)-6- (trifluoromethyl) pyridin-2- yl]oxy}cyclohexyl)- 3-[4-(7H-pyrrolo[2,3- d]pyrimidin-4-yl)- 1H-pyrazol-1- yl]azetidin-3- yl}aceionitrile
Type:
Small organic molecule
Emp. Form.:
C29H31F3N8O2
Mol. Mass.:
580.604
SMILES:
CC(C)(O)c1cc(O[C@H]2CC[C@H](CC2)N2CC(CC#N)(C2)n2cc(cn2)-c2ncnc3[nH]ccc23)nc(c1)C(F)(F)F
: