Target
Tyrosine-protein kinase JAK1
Ligand
BDBM246888
Substrate
Meas. Tech.
Alphascreen Assay
IC50
<10±n/a nM
Citation
 Qiao, LWeng, LMeloni, DJia, ZWang, JZhou, J Salts and processes of preparing a PI3K inhibitor US Patent  US11084822 Publication Date 8/10/2021 
Target
Name:
Tyrosine-protein kinase JAK1
Synonyms:
JAK-1 JAK1A JAK1_HUMAN Janus kinase 1 (JAK1) | Janus kinase 1 JAK1
Type:
Protein
Mol. Mass.:
133293.73
Organism:
Homo sapiens (Human)
Description:
P23458
Residue:
1154
  
Inhibitor
Name:
BDBM246888
Synonyms:
US10053465, 26 US10125150, Example 26 US10479803, Example 26 US11084822, Example 26 US11136326, Example 26 US11324749, Comp. No. 26 US11596632, Comp. No. 26 US9732097, Example 26 | trans-3-(4-{[4-(2- hydroxyethyl)-6- (trifluoromethyl) pyridin-2- yl]oxy}piperidin-1- yl)-1-[4-(7H- pyrrolo[2,3- d]pyrimidin-4-yl)- 1H-pyrazol-1- yl]cyclobutyl} acetonitrile
Type:
Small organic molecule
Emp. Form.:
C28H29F3N8O2
Mol. Mass.:
566.5775
SMILES:
OCCc1cc(OC2CCN(CC2)[C@H]2C[C@@](CC#N)(C2)n2cc(cn2)-c2ncnc3[nH]ccc23)nc(c1)C(F)(F)F
: