Target
Retinoic acid receptor RXR-beta
Ligand
BDBM524170
Substrate
Meas. Tech.
FLIPR Assay
IC50
690±n/a nM
Citation
 Giovannini, RCeci, ADorner-Ciossek, CPfau, RWiedenmayer, D 4-pyrazin-2-ylmethyl-morpholine derivatives and the use thereof as medicament US Patent  US11166958 Publication Date 11/9/2021 
Target
Name:
Retinoic acid receptor RXR-beta
Synonyms:
NR2B2 RXRB Retinoic acid receptor RXR-beta Retinoid receptor
Type:
PROTEIN
Mol. Mass.:
56932.89
Organism:
Homo sapiens (Human)
Description:
ChEMBL_39045
Residue:
533
  
Inhibitor
Name:
BDBM524170
Synonyms:
US11166958, Example 3
Type:
Small organic molecule
Emp. Form.:
C18H22N4O3
Mol. Mass.:
342.3923
SMILES:
CNC(=O)[C@@H]1CN(Cc2cnc(Oc3ccc(C)cc3)cn2)CCO1
: