Target
Oxysterols receptor LXR-alpha
Ligand
BDBM304403
Substrate
Meas. Tech.
LXR alpha/beta Radioligand Binding Assay
Ki
59.0±n/a nM
Citation
 Claremon, DADong, CFan, YLeftheris, KLotesta, SDSingh, SBTice, CMZhao, WZheng, YZhuang, L Piperazine derivatives as liver X receptor modulators US Patent  US10144715 Publication Date 12/4/2018 
Target
Name:
Oxysterols receptor LXR-alpha
Synonyms:
LXRA Liver X receptor alpha Liver X receptor alpha (NR1H3) NR1H3 Nuclear orphan receptor LXR-alpha | Nuclear receptor subfamily 1 group H member 3
Type:
Enzyme Catalytic Domain
Mol. Mass.:
50403.85
Organism:
Homo sapiens (Human)
Description:
Q13133
Residue:
447
  
Inhibitor
Name:
BDBM304403
Synonyms:
2-(2-(2-(tert-butyl)-4-(4-fluoro-3-(methylsulfonyl)phenyl)piperazin-1-yl)-4-(trifluoromethyl)pyrimidin-5-yl)propan-2-ol | US10144715, Compound 10-4
Type:
Small organic molecule
Emp. Form.:
C23H30F4N4O3S
Mol. Mass.:
518.568
SMILES:
CC(C)(C)C1CN(CCN1c1ncc(c(n1)C(F)(F)F)C(C)(C)O)c1ccc(F)c(c1)S(C)(=O)=O
: