Target
Oxysterols receptor LXR-alpha
Ligand
BDBM304673
Substrate
Meas. Tech.
LXR alpha/beta Radioligand Binding Assay
Ki
50.0±n/a nM
Citation
 Claremon, DADong, CFan, YLeftheris, KLotesta, SDSingh, SBTice, CMZhao, WZheng, YZhuang, L Piperazine derivatives as liver X receptor modulators US Patent  US10144715 Publication Date 12/4/2018 
Target
Name:
Oxysterols receptor LXR-alpha
Synonyms:
LXRA Liver X receptor alpha Liver X receptor alpha (NR1H3) NR1H3 Nuclear orphan receptor LXR-alpha | Nuclear receptor subfamily 1 group H member 3
Type:
Enzyme Catalytic Domain
Mol. Mass.:
50403.85
Organism:
Homo sapiens (Human)
Description:
Q13133
Residue:
447
  
Inhibitor
Name:
BDBM304673
Synonyms:
(S)-1-(((3S,6r)-1,1-difluorospiro[2.5]octan-6-yl)methyl)-4-(3-(methylsulfonyl)phenyl)-2-phenylpiperazine | US10144715, Compound 48-71
Type:
Small organic molecule
Emp. Form.:
C26H32F2N2O2S
Mol. Mass.:
474.606
SMILES:
CS(=O)(=O)c1cccc(c1)N1CCN(C[C@H]2CC[C@@]3(CC3(F)F)CC2)[C@H](C1)c1ccccc1
: