Target
Tyrosine-protein kinase JAK2 [831-1132]
Ligand
BDBM313401
Substrate
Meas. Tech.
Enzyme Inhibition Assay
IC50
2040±n/a nM
Citation
 Astrand, ABGrimster, NPKawatkar, SKettle, JGNilsson, MKRuston, LSu, QVasbinder, MWinter-Holt, JJWoessner, RDChuaqui, CEMcCabe, J Compounds and methods for inhibiting JAK US Patent  US11247983 Publication Date 2/15/2022 
Target
Name:
Tyrosine-protein kinase JAK2 [831-1132]
Synonyms:
JAK2 JAK2_HUMAN | Tyrosine-protein kinase JAK2 (aa 831-1132)
Type:
Enzyme Catalytic Domain
Mol. Mass.:
35337.99
Organism:
Homo sapiens (Human)
Description:
O60674[831-1132]
Residue:
302
  
Inhibitor
Name:
BDBM313401
Synonyms:
(2R)-N-(3-{2-[(3-ethoxy-1-methyl-1H- pyrazol-4-yl)amino]-5- methylpyrimidin-4-yl}-1H-indol-7-yl)- 3-methoxy-2-(4-methylpiperazin-1- yl)propanamide US10654835, Example 64 | US11247983, Example 64
Type:
Small organic molecule
Emp. Form.:
C28H37N9O3
Mol. Mass.:
547.6519
SMILES:
CCOc1nn(C)cc1Nc1ncc(C)c(n1)-c1c[nH]c2c(NC(=O)[C@@H](COC)N3CCN(C)CC3)cccc12
: