Target
Programmed cell death 1 ligand/protein 1
Ligand
BDBM452007
Substrate
Meas. Tech.
Biochemical Protein-Protein Interaction Assay
IC50
0.060±n/a nM
Citation
Target
Name:
Programmed cell death 1 ligand/protein 1
Synonyms:
PD-1/PD-L1 | Programmed cell death protein 1/Programmed cell death 1 ligand 1
Type:
Protein
Mol. Mass.:
Description:
Components:
This complex has 2 components.
Component 1
Name:
Programmed cell death protein 1
Synonyms:
CD_antigen=CD279 PDCD1 Programmed cell death protein 1 hPD-1
Type:
PROTEIN
Mol. Mass.:
31650.07
Organism:
Homo sapiens
Description:
ChEMBL_108437
Residue:
288
  
Component 2
Name:
Programmed cell death 1 ligand 1
Synonyms:
B7 homolog 1 B7H1 CD274 PD-L1 PDCD1 ligand 1 PDCD1LG1 Programmed cell death 1 ligand 1 | Programmed death ligand 1
Type:
PROTEIN
Mol. Mass.:
33278.49
Organism:
Homo sapiens (Human)
Description:
ChEMBL_109807
Residue:
290
  
Inhibitor
Name:
BDBM452007
Synonyms:
US10710986, Example 147 | US11555029, No. 147
Type:
Small organic molecule
Emp. Form.:
C32H34Cl2N6O4
Mol. Mass.:
637.556
SMILES:
COc1nc(cnc1CN1CC(C)(O)C1)-c1cccc(c1Cl)-c1cccc(c1Cl)-c1cnc(CN2CC(C)(O)C2)c(OC)n1
: