Target
Apoptosis regulator Bcl-2
Ligand
BDBM552908
Substrate
Meas. Tech.
Bcl-2 Protein Family Binding Assay
Kd
<10±n/a nM
Citation
 Pinchman, JRHuang, PQBunker, KDSit, RKSamatar, AA Benzamide compounds US Patent  US11590126 Publication Date 2/28/2023 
Target
Name:
Apoptosis regulator Bcl-2
Synonyms:
Apoptosis regulator Bcl-2 Protein BCL-2 BCL2_HUMAN | Bcl-2 Protein
Type:
Homodimer or heterodimer
Mol. Mass.:
26269.11
Organism:
Homo sapiens (Human)
Description:
P10415
Residue:
239
  
Inhibitor
Name:
BDBM552908
Synonyms:
2-(1H-pyrrolo[2,3-b]pyridin-5-yloxy)-4-(4-((2-(3-fluorobicyclo[1.1.1]pentan-1-yl)-4,4-dimethylcyclohex-1-enyl)methyl)piperazin-1-yl)-N-(3-nitro-4-((tetrahydro-2H-pyran-4-yl)methylamino)phenylsulfonyl)benzamide US11344546, Example 10 | US11590126, Example 10
Type:
Small organic molecule
Emp. Form.:
C44H52FN7O7S
Mol. Mass.:
841.99
SMILES:
CC1(C)CCC(CN2CCN(CC2)c2ccc(C(=O)NS(=O)(=O)c3ccc(NCC4CCOCC4)c(c3)[N+]([O-])=O)c(Oc3cnc4[nH]ccc4c3)c2)=C(C1)C12CC(F)(C1)C2
: