Target
Apoptosis regulator Bcl-2
Ligand
BDBM552916
Substrate
Meas. Tech.
Bcl-2 Protein Family Binding Assay
Kd
<10±n/a nM
Citation
 Pinchman, JRHuang, PQBunker, KDSit, RKSamatar, AA Benzamide compounds US Patent  US11590126 Publication Date 2/28/2023 
Target
Name:
Apoptosis regulator Bcl-2
Synonyms:
Apoptosis regulator Bcl-2 Protein BCL-2 BCL2_HUMAN | Bcl-2 Protein
Type:
Homodimer or heterodimer
Mol. Mass.:
26269.11
Organism:
Homo sapiens (Human)
Description:
P10415
Residue:
239
  
Inhibitor
Name:
BDBM552916
Synonyms:
2-((1H-pyrrolo[2,3-b]pyridin-5-yl)oxy)-4-(4-((2-(3-ethylbicyclo[1.1.1]pentan-1-yl)-4,4-dimethylcyclohex-1-en-1-yl)methyl)piperazin-1-yl)-N-((4-(((4-fluorotetrahydro-2H-pyran-4-yl)methyl)amino)-3-nitrophenyl)sulfonyl)benzamide US11590126, Example 25
Type:
Small organic molecule
Emp. Form.:
C46H56FN7O7S
Mol. Mass.:
870.043
SMILES:
CCC12CC(C1)(C2)C1=C(CN2CCN(CC2)c2ccc(C(=O)NS(=O)(=O)c3ccc(NCC4(F)CCOCC4)c(c3)[N+]([O-])=O)c(Oc3cnc4[nH]ccc4c3)c2)CCC(C)(C)C1
: