Target
Potassium channel subfamily K member 2
Ligand
BDBM533100
Substrate
Meas. Tech.
LMPTP Primary Screening Protocol
IC50
500±n/a nM
Citation
 Bottini, NZou, JGanji, SRStanford, SPinkerton, AChung, TDHedrick, MArdecky, R Inhibitors of low molecular weight protein tyrosine phosphatase and uses thereof US Patent  US10626094 Publication Date 4/21/2020 
Target
Name:
Potassium channel subfamily K member 2
Synonyms:
KCNK2 Outward rectifying potassium channel protein TREK-1 TREK-1 K(+) channel subunit Twik-RElated Potassium (K+) channel 1 (TREK1) Two pore potassium channel TPKC1
Type:
Protein
Mol. Mass.:
47099.16
Organism:
Homo sapiens (Human)
Description:
O95069
Residue:
426
  
Inhibitor
Name:
BDBM533100
Synonyms:
US10626094, Example I30 {3-[(1-ethyl(4-piperidyl))methyl]phenyl}[2-(4- methoxyphenyl)(4-quinolyl)]amine
Type:
Small organic molecule
Emp. Form.:
C30H33N3O
Mol. Mass.:
451.6025
SMILES:
CCN1CCC(Cc2cccc(Nc3cc(nc4ccccc34)-c3ccc(OC)cc3)c2)CC1
: