Target
Histone deacetylase 1
Ligand
BDBM468581
Substrate
Meas. Tech.
HDAC Inhibition Assay
IC50
>50000±n/a nM
Citation
 Liao, DRoush, WRStowe, RL HDAC inhibitor compounds and methods of treatment US Patent  US11731934 Publication Date 8/22/2023 
Target
Name:
Histone deacetylase 1
Synonyms:
Cereblon/Histone deacetylase 1 HDAC1 Histone deacetylase 1 (HDAC1) RPD3L1
Type:
Enzyme
Mol. Mass.:
55090.27
Organism:
Homo sapiens (Human)
Description:
Q13547
Residue:
482
  
Inhibitor
Name:
BDBM468581
Synonyms:
US10807944, Compound RLS2-185 | US11731934, Compound RLS2-185
Type:
Small organic molecule
Emp. Form.:
C10H14N2O
Mol. Mass.:
178.231
SMILES:
CC(C)NNC(=O)c1ccccc1
: