Target
Histone deacetylase 1
Ligand
BDBM163632
Substrate
Meas. Tech.
HDAC Inhibition Assay
IC50
7400±n/a nM
Citation
 Liao, DRoush, WRStowe, RL HDAC inhibitor compounds and methods of treatment US Patent  US11731934 Publication Date 8/22/2023 
Target
Name:
Histone deacetylase 1
Synonyms:
Cereblon/Histone deacetylase 1 HDAC1 Histone deacetylase 1 (HDAC1) RPD3L1
Type:
Enzyme
Mol. Mass.:
55090.27
Organism:
Homo sapiens (Human)
Description:
Q13547
Residue:
482
  
Inhibitor
Name:
BDBM163632
Synonyms:
SR-3297 US11731934, Compound RLS2-219
Type:
Small organic molecule
Emp. Form.:
C14H19BrN2O
Mol. Mass.:
311.217
SMILES:
Brc1ccc(cc1)C(=O)NNCCC1CCCC1
: