Target
Histone deacetylase 2
Ligand
BDBM163632
Substrate
IC50
7650±n/a nM
Citation
 Liao, DRoush, WRStowe, RL HDAC inhibitor compounds and methods of treatment US Patent  US11731934 Publication Date 8/22/2023 
Target
Name:
Histone deacetylase 2
Synonyms:
Cereblon/Histone deacetylase 2 HDAC2 Histone deacetylase 2 (HDAC2) | Human HDAC2
Type:
Chromatin regulator; hydrolase; repressor
Mol. Mass.:
55356.54
Organism:
Homo sapiens (Human)
Description:
Q92769
Residue:
488
  
Inhibitor
Name:
BDBM163632
Synonyms:
SR-3297 US11731934, Compound RLS2-219
Type:
Small organic molecule
Emp. Form.:
C14H19BrN2O
Mol. Mass.:
311.217
SMILES:
Brc1ccc(cc1)C(=O)NNCCC1CCCC1
: