Target
Casein kinase I isoform alpha
Ligand
BDBM10839
Substrate
Casein
Meas. Tech.
Kinase Inhibition Assay
Temperature
303.15±n/a K
IC50
1000±n/a nM
Comments
extracted
Citation
 Gompel, MLeost, MDe Kier Joffe, EBPuricelli, LFranco, LHPalermo, JMeijer, L Meridianins, a new family of protein kinase inhibitors isolated from the ascidian Aplidium meridianum. Bioorg Med Chem Lett 14:1703-7 (2004)  
Target
Name:
Casein kinase I isoform alpha
Synonyms:
CK1 Casein Kinase I KC1A_RAT
Type:
Enzyme
Mol. Mass.:
37514.97
Organism:
Rattus norvegicus (rat)
Description:
Residue:
325
  
Inhibitor
Name:
BDBM10839
Synonyms:
3-(2-aminopyrimidin-4-yl)-6-bromo-1H-indol-4-ol | Meridianin B
Type:
Small organic molecule
Emp. Form.:
C12H9BrN4O
Mol. Mass.:
305.13
SMILES:
Nc1nccc(n1)-c1c[nH]c2cc(Br)cc(O)c12
:
Substrate
Name:
Casein
Synonyms:
Type:
Other Protein Type
Mol. Mass.:
20807.68
Organism:
Homo sapiens (Human)
Description:
Residue:
177