Target
DNA damage-binding protein 1/Protein cereblon
Ligand
BDBM65454
Substrate
Meas. Tech.
TR-FRET cereblon binding assay
pH
7±n/a
IC50
1500±0 nM
Comments
extracted
Citation
 Matyskiela, MEZhang, WMan, HWMuller, GKhambatta, GBaculi, FHickman, MLeBrun, LPagarigan, BCarmel, GLu, CCLu, GRiley, MSatoh, YSchafer, PDaniel, TOCarmichael, JCathers, BEChamberlain, PP A Cereblon Modulator (CC-220) with Improved Degradation of Ikaros and Aiolos. J Med Chem 61:535-542 (2017)  
Target
Name:
DNA damage-binding protein 1/Protein cereblon
Synonyms:
CRBN-DDB1 Cereblon_DDB1 | Protein cereblon/DNA damage-binding protein 1
Type:
Enzyme
Mol. Mass.:
Description:
Components:
This complex has 2 components.
Component 1
Name:
DNA damage-binding protein 1
Synonyms:
DDB p127 subunit DDB1_HUMAN DNA damage-binding protein a HBV X-associated protein 1 UV-damaged DNA-binding factor XAP-1 XPCe XPE-binding factor | Xeroderma pigmentosum group E-complementing protein
Type:
Protein
Mol. Mass.:
126936.22
Organism:
Homo sapiens (Human)
Description:
Q16531
Residue:
1140
  
Component 2
Name:
Protein cereblon
Synonyms:
CRBN | CRBN_HUMAN
Type:
PROTEIN
Mol. Mass.:
50537.73
Organism:
Homo sapiens (Human)
Description:
ChEMBL_116917
Residue:
442
  
Inhibitor
Name:
BDBM65454
Synonyms:
191732-72-6 Lenalidomide Revlimid US9694015, 6.1
Type:
Small organic molecule
Emp. Form.:
C13H13N3O3
Mol. Mass.:
259.2606
SMILES:
Nc1cccc2C(=O)N(Cc12)C1CCC(=O)NC1=O
: