Target
Lethal factor
Ligand
BDBM12006
Substrate
MAPKKide
Meas. Tech.
Fluorescence Resonance Energy Transfer Assay (FRET)
pH
7.4±n/a
Temperature
295.15±n/a K
Ki
8800±2400 nM
Citation
 Jiao, GSSimo, ONagata, MO'Malley, SHemscheidt, TCregar, LMillis, SZGoldman, METang, C Selectively guanidinylated derivatives of neamine. Syntheses and inhibition of anthrax lethal factor protease. Bioorg Med Chem Lett 16:5183-9 (2006)  
Target
Name:
Lethal factor
Synonyms:
Anthrax Lethal Factor (LF) Antrax lethal toxin lef | lethal factor
Type:
PROTEIN
Mol. Mass.:
93758.56
Organism:
Bacillus anthracis
Description:
ChEMBL_1460338
Residue:
809
  
Inhibitor
Name:
BDBM12006
Synonyms:
(1S,2R,3R,4S,5R)-5-amino-2-{[(2R,3R,4R,5S,6R)-3-amino-6-(carbamimidamidomethyl)-4,5-dihydroxyoxan-2-yl]oxy}-3,4-dihydroxycyclohexane-1-guanidine Neamine guanidinylated deriv. 15
Type:
Small organic molecule
Emp. Form.:
C14H30N8O6
Mol. Mass.:
406.438
SMILES:
[#7]-[#6@@H]-1-[#6]-[#6@H](\[#7]=[#6](/[#7])-[#7])-[#6@@H](-[#8]-[#6@H]-2-[#8]-[#6@H](-[#6]\[#7]=[#6](\[#7])-[#7])-[#6@@H](-[#8])-[#6@H](-[#8])-[#6@H]-2-[#7])-[#6@H](-[#8])-[#6@H]-1-[#8]
:
Substrate
Name:
MAPKKide
Synonyms:
Type:
Peptide
Mol. Mass.:
358.43
Organism:
Description:
MAPPKKide is a quenched fluoresent substrate peptide based on fluorescence resonance energy transfer (FRET). The C-terminally linked fluorophore of MAPKKide is a FITC, and the acceptor chromophore is 4-([4-(dimethylamino)-phenyl] azo) benzoic acid (DABCYL) (List Biological Laboratories, Inc, Campbell, CA).
Residue:
3
NA