Target
Lethal factor
Ligand
BDBM12011
Substrate
MAPKKide
Meas. Tech.
Fluorescence Resonance Energy Transfer Assay (FRET)
pH
7.4±n/a
Temperature
295.15±n/a K
Ki
9200±1100 nM
Citation
 Jiao, GSSimo, ONagata, MO'Malley, SHemscheidt, TCregar, LMillis, SZGoldman, METang, C Selectively guanidinylated derivatives of neamine. Syntheses and inhibition of anthrax lethal factor protease. Bioorg Med Chem Lett 16:5183-9 (2006)  
Target
Name:
Lethal factor
Synonyms:
Anthrax Lethal Factor (LF) Antrax lethal toxin lef | lethal factor
Type:
PROTEIN
Mol. Mass.:
93758.56
Organism:
Bacillus anthracis
Description:
ChEMBL_1460338
Residue:
809
  
Inhibitor
Name:
BDBM12011
Synonyms:
(2R,3R,4R,5S,6R)-2-{[(1R,2R,3S,4R,6S)-4-amino-6-carbamimidamido-2,3-dihydroxycyclohexyl]oxy}-6-(carbamimidamidomethyl)-4,5-dihydroxyoxane-3-guanidine | Neamine guanidinylated deriv. 25
Type:
Small organic molecule
Emp. Form.:
C15H32N10O6
Mol. Mass.:
448.478
SMILES:
[#7]-[#6@@H]-1-[#6]-[#6@H](\[#7]=[#6](/[#7])-[#7])-[#6@@H](-[#8]-[#6@H]-2-[#8]-[#6@H](-[#6]\[#7]=[#6](\[#7])-[#7])-[#6@@H](-[#8])-[#6@H](-[#8])-[#6@H]-2\[#7]=[#6](\[#7])-[#7])-[#6@H](-[#8])-[#6@H]-1-[#8]
:
Substrate
Name:
MAPKKide
Synonyms:
Type:
Peptide
Mol. Mass.:
358.43
Organism:
Description:
MAPPKKide is a quenched fluoresent substrate peptide based on fluorescence resonance energy transfer (FRET). The C-terminally linked fluorophore of MAPKKide is a FITC, and the acceptor chromophore is 4-([4-(dimethylamino)-phenyl] azo) benzoic acid (DABCYL) (List Biological Laboratories, Inc, Campbell, CA).
Residue:
3
NA