Target
Rho-associated protein kinase 1
Ligand
BDBM14027
Substrate
ROCK I Peptide Substrate
Meas. Tech.
Kinase Activity Assay
pH
7.6±n/a
Temperature
303.15±n/a K
Ki
530±n/a nM
Citation
 Jacobs, MHayakawa, KSwenson, LBellon, SFleming, MTaslimi, PDoran, J The structure of dimeric ROCK I reveals the mechanism for ligand selectivity. J Biol Chem 281:260-8 (2006)  
Target
Name:
Rho-associated protein kinase 1
Synonyms:
ROCK-I ROCK1_HUMAN Rho-associated protein kinase Rho-associated, coiled-coil-containing protein kinase 1 Rho-kinase (ROCK I) p160 ROCK-1 | p160ROCK
Type:
Serine/threonine-protein kinase
Mol. Mass.:
158156.77
Organism:
Homo sapiens (Human)
Description:
Q13464
Residue:
1354
  
Inhibitor
Name:
BDBM14027
Synonyms:
5-(1,4-diazepan-1-ylsulfonyl)isoquinoline AT877 CHEMBL541388 HA-1077 cid_163751
Type:
Small organic molecule
Emp. Form.:
C14H17N3O2S
Mol. Mass.:
291.369
SMILES:
O=S(=O)(N1CCCNCC1)c1cccc2cnccc12
:
Substrate
Name:
ROCK I Peptide Substrate
Synonyms:
Type:
Peptide
Mol. Mass.:
1105.34
Organism:
Description:
Residue:
9
KKRNRTLSV