Target
Coagulation factor X
Ligand
BDBM14863
Substrate
BDBM12989
Meas. Tech.
Enzyme Inhibition Assay
pH
7.4±n/a
Temperature
295.15±n/a K
Ki
2700±n/a nM
Citation
 Riggs, JRHu, HKolesnikov, ALeahy, EMWesson, KEShrader, WDVijaykumar, DWahl, TATong, ZSprengeler, PAGreen, MJYu, CKatz, BASanford, ENguyen, MCabuslay, RYoung, WB Novel 5-azaindole factor VIIa inhibitors. Bioorg Med Chem Lett 16:3197-200 (2006)  
Target
Name:
Coagulation factor X
Synonyms:
Activated coagulation factor X (FXa) Coagulation factor X precursor F10 Factor X heavy chain Factor Xa Stuart-Prower factor
Type:
Enzyme
Mol. Mass.:
54726.60
Organism:
Homo sapiens (Human)
Description:
Residue:
488
  
Inhibitor
Name:
BDBM14863
Synonyms:
({3-[3-(5-carbamimidoyl-1H-1,3-benzodiazol-2-yl)-2-hydroxyphenyl]-4-hydroxyphenyl}methyl)urea CHEMBL378916
Type:
Small organic molecule
Emp. Form.:
C22H20N6O3
Mol. Mass.:
416.4326
SMILES:
NC(=O)NCc1ccc(O)c(c1)-c1cccc(-c2nc3ccc(cc3[nH]2)C(N)=N)c1O
:
Substrate
Name:
BDBM12989
Synonyms:
CH3OCO-D-CHA-Gly-Arg-pNA.AcOH acetic acid; methyl N-[(1R)-1-[({[(1S)-4-carbamimidamido-1-[(4-nitrophenyl)carbamoyl]butyl]carbamoyl}methyl)carbamoyl]-2-cyclohexylethyl]carbamate
Type:
Small organic molecule
Emp. Form.:
C25H38N8O7
Mol. Mass.:
562.6186
SMILES:
COC(=O)N[C@H](CC1CCCCC1)C(=O)NCC(=O)N[C@@H](CCC[NH+]=C(N)[NH-])C(=O)Nc1ccc(cc1)[N+]([O-])=O
: