Target
Serine protease 1
Ligand
BDBM14864
Substrate
BDBM12679
Meas. Tech.
Enzyme Inhibition Assay
pH
7.4±n/a
Temperature
295.15±n/a K
Ki
46500±n/a nM
Citation
 Riggs, JRHu, HKolesnikov, ALeahy, EMWesson, KEShrader, WDVijaykumar, DWahl, TATong, ZSprengeler, PAGreen, MJYu, CKatz, BASanford, ENguyen, MCabuslay, RYoung, WB Novel 5-azaindole factor VIIa inhibitors. Bioorg Med Chem Lett 16:3197-200 (2006)  
Target
Name:
Serine protease 1
Synonyms:
Beta-Trypsin PRSS1 TRY1 TRYP1 Trypsin I
Type:
Enzyme
Mol. Mass.:
25790.52
Organism:
Bos taurus (bovine)
Description:
P00760
Residue:
246
  
Inhibitor
Name:
BDBM14864
Synonyms:
5-azaindole analog 2 | {[3-(2-hydroxy-3-{1H-pyrrolo[3,2-c]pyridin-2-yl}phenyl)phenyl]methyl}urea
Type:
Small organic molecule
Emp. Form.:
C21H18N4O2
Mol. Mass.:
358.3932
SMILES:
NC(=O)NCc1cccc(c1)-c1cccc(-c2cc3cnccc3[nH]2)c1O
:
Substrate
Name:
BDBM12679
Synonyms:
BDBM13790 Chromogenic Substrate
Type:
Small organic molecule
Emp. Form.:
C26H34N6O7S
Mol. Mass.:
574.649
SMILES:
Cc1ccc(cc1)S(=O)(=O)NCC(=O)N1CCCC1C(=O)NC(CCCCN)C(=O)Nc1ccc(cc1)[N+]([O-])=O
: