Target
Coagulation factor VII
Ligand
BDBM14889
Substrate
BDBM13777
Meas. Tech.
Enzyme Inhibition Assay
Ki
130000±n/a nM
Citation
 Riggs, JRHu, HKolesnikov, ALeahy, EMWesson, KEShrader, WDVijaykumar, DWahl, TATong, ZSprengeler, PAGreen, MJYu, CKatz, BASanford, ENguyen, MCabuslay, RYoung, WB Novel 5-azaindole factor VIIa inhibitors. Bioorg Med Chem Lett 16:3197-200 (2006)  
Target
Name:
Coagulation factor VII
Synonyms:
Eptacog alfa FA7_HUMAN Factor VIIa (fVIIa) SPCA serum prothrombin conversion accelerator
Type:
Enzyme
Mol. Mass.:
51599.89
Organism:
Homo sapiens (Human)
Description:
Residue:
466
  
Inhibitor
Name:
BDBM14889
Synonyms:
5-azaindole analog 27 | N-{[3-(2-hydroxy-3-{1H-pyrrolo[3,2-c]pyridin-2-yl}phenyl)phenyl]methyl}-4-methylpiperazine-1-carboxamide
Type:
Small organic molecule
Emp. Form.:
C26H27N5O2
Mol. Mass.:
441.5249
SMILES:
CN1CCN(CC1)C(=O)NCc1cccc(c1)-c1cccc(-c2cc3cnccc3[nH]2)c1O
:
Substrate
Name:
BDBM13777
Synonyms:
(2S)-5-carbamimidamido-2-{2-[(2R)-3-cyclohexyl-2-methanesulfonamidopropanamido]butanamido}-N-(4-nitrophenyl)pentanamide; acetic acid Pefachrome FVIIa
Type:
Small organic molecule
Emp. Form.:
C26H42N8O7S
Mol. Mass.:
610.726
SMILES:
CCC(NC(=O)C(CC1CCCCC1)NS(C)(=O)=O)C(=O)NC(CCC\[NH+]=C(\N)[NH-])C(=O)Nc1ccc(cc1)[N+]([O-])=O
: