Target
Coagulation factor VII
Ligand
BDBM14891
Substrate
BDBM13777
Meas. Tech.
Enzyme Inhibition Assay
Ki
9500±n/a nM
Citation
 Riggs, JRHu, HKolesnikov, ALeahy, EMWesson, KEShrader, WDVijaykumar, DWahl, TATong, ZSprengeler, PAGreen, MJYu, CKatz, BASanford, ENguyen, MCabuslay, RYoung, WB Novel 5-azaindole factor VIIa inhibitors. Bioorg Med Chem Lett 16:3197-200 (2006)  
Target
Name:
Coagulation factor VII
Synonyms:
Eptacog alfa FA7_HUMAN Factor VIIa (fVIIa) SPCA serum prothrombin conversion accelerator
Type:
Enzyme
Mol. Mass.:
51599.89
Organism:
Homo sapiens (Human)
Description:
Residue:
466
  
Inhibitor
Name:
BDBM14891
Synonyms:
2-(2,6-difluorophenyl)-N-{[3-(2-hydroxy-3-{1H-pyrrolo[3,2-c]pyridin-2-yl}phenyl)phenyl]methyl}acetamide | 5-azaindole analog 29
Type:
Small organic molecule
Emp. Form.:
C28H21F2N3O2
Mol. Mass.:
469.482
SMILES:
Oc1c(cccc1-c1cccc(CNC(=O)Cc2c(F)cccc2F)c1)-c1cc2cnccc2[nH]1
:
Substrate
Name:
BDBM13777
Synonyms:
(2S)-5-carbamimidamido-2-{2-[(2R)-3-cyclohexyl-2-methanesulfonamidopropanamido]butanamido}-N-(4-nitrophenyl)pentanamide; acetic acid Pefachrome FVIIa
Type:
Small organic molecule
Emp. Form.:
C26H42N8O7S
Mol. Mass.:
610.726
SMILES:
CCC(NC(=O)C(CC1CCCCC1)NS(C)(=O)=O)C(=O)NC(CCC\[NH+]=C(\N)[NH-])C(=O)Nc1ccc(cc1)[N+]([O-])=O
: