Target
Oxysterols receptor LXR-alpha
Ligand
BDBM20158
Substrate
biotinylated SRC-1 peptide
Meas. Tech.
Cell-Free Ligand Sensing Assay (LiSA)-LXRalpha-SRC1 Assay
pH
7.5±n/a
Temperature
295.15±n/a K
EC50
130±30 nM
Comments
The relative efficacy (RE) compared to GW3965 is 0.3 in LXRalpha-SRC1 assay. The EC50=1.42 +/- 0.24 uM for ABCA1 gene expression with RE=0.4.
Citation
 Jaye, MCKrawiec, JACampobasso, NSmallwood, AQiu, CLu, QKerrigan, JJDe Los Frailes Alvaro, MLaffitte, BLiu, WSMarino, JPMeyer, CRNichols, JAParks, DJPerez, PSarov-Blat, LSeepersaud, SDSteplewski, KMThompson, SKWang, PWatson, MAWebb, CLHaigh, DCaravella, JAMacphee, CHWillson, TMCollins, JL Discovery of substituted maleimides as liver X receptor agonists and determination of a ligand-bound crystal structure. J Med Chem 48:5419-22 (2005)  
Target
Name:
Oxysterols receptor LXR-alpha
Synonyms:
LXRA Liver X receptor alpha Liver X receptor alpha (NR1H3) NR1H3 Nuclear orphan receptor LXR-alpha | Nuclear receptor subfamily 1 group H member 3
Type:
Enzyme Catalytic Domain
Mol. Mass.:
50403.85
Organism:
Homo sapiens (Human)
Description:
Q13133
Residue:
447
  
Inhibitor
Name:
BDBM20158
Synonyms:
1-benzyl-3-[(4-chlorophenyl)amino]-4-phenyl-2,5-dihydro-1H-pyrrole-2,5-dione Substituted Maleimide, 6
Type:
Small organic molecule
Emp. Form.:
C23H17ClN2O2
Mol. Mass.:
388.846
SMILES:
Clc1ccc(NC2=C(C(=O)N(Cc3ccccc3)C2=O)c2ccccc2)cc1
:
Substrate
Name:
biotinylated SRC-1 peptide
Synonyms:
Type:
Peptide
Mol. Mass.:
3157.52
Organism:
Description:
A biotinylated peptide comprises amino acids 675-699 of steroid receptor coactivator 1 (SRC1).
Residue:
28