Target
Adenosine receptor A1
Ligand
BDBM21216
Substrate
BDBM21173
Meas. Tech.
Human A1 Adenosine Receptor Binding Assay
pH
7.4±n/a
Temperature
298.15±n/a K
Ki
0.5±0.01 nM
Citation
 Cosimelli, BGreco, GEhlardo, MNovellino, EDa Settimo, FTaliani, SLa Motta, CBellandi, MTuccinardi, TMartinelli, ACiampi, OTrincavelli, MLMartini, C Derivatives of 4-Amino-6-hydroxy-2-mercaptopyrimidine as Novel, Potent, and Selective A3 Adenosine Receptor Antagonists. J Med Chem 51:1764-70 (2008)  
Target
Name:
Adenosine receptor A1
Synonyms:
A1 adenosine receptor (hA1) AA1R_HUMAN ADORA1 Adenosine A1-receptor Adenosine receptor A1 (hA1) | Adenosine transporter (AdT)
Type:
G Protein-Coupled Receptor (GPCR)
Mol. Mass.:
36520.92
Organism:
Homo sapiens (Human)
Description:
P30542
Residue:
326
  
Inhibitor
Name:
BDBM21216
Synonyms:
2-[4-(ethylsulfanyl)-1H-1,3-benzodiazol-2-yl]quinoxaline CHEMBL198008 | benzimidazole-quinoxaline, C2
Type:
Small organic molecule
Emp. Form.:
C17H14N4S
Mol. Mass.:
306.385
SMILES:
CCSc1cccc2nc([nH]c12)-c1cnc2ccccc2n1
:
Substrate
Name:
BDBM21173
Synonyms:
1,3-dipropyl-8-cyclopentylxanthine CHEMBL183 PD116948 | [3H]DPCPX
Type:
radiolabeled ligand
Emp. Form.:
C16H24N4O2
Mol. Mass.:
304.3874
SMILES:
CCCn1c2nc([nH]c2c(=O)n(CCC)c1=O)C1CCCC1
: