Target
Complement factor D
Ligand
BDBM386482
Substrate
Meas. Tech.
Human Factor D Assay
IC50
<1000±n/a nM
Citation
 Wiles, JAPhadke, ASDeshpande, MAgarwal, AChen, DGadhachanda, VRHashimoto, APais, GWang, QWang, X Aryl, heteroaryl, and heterocyclic compounds for treatment of medical disorders US Patent  US10287301 Publication Date 5/14/2019 
Target
Name:
Complement factor D
Synonyms:
Adipsin CFAD_HUMAN DF Properdin factor D
Type:
Protein
Mol. Mass.:
27039.19
Organism:
Homo sapiens (Human)
Description:
P00746
Residue:
253
  
Inhibitor
Name:
BDBM386482
Synonyms:
(1S,3S,5R)-2-(2- (3-acetyl-5-(2- methylpyrimidin- 5-yl)-1H-indazol- 1-yl)acetyl)-N-(6- bromopyridin-2- yl)-5- (methoxymethyl)-2- azabicyclo[3.1.0] hexane-3- carboxamide US10822352, Comp No. 417
Type:
Small organic molecule
Emp. Form.:
C29H28BrN7O4
Mol. Mass.:
618.481
SMILES:
COC[C@@]12C[C@@H]1N([C@@H](C2)C(=O)Nc1cccc(Br)n1)C(=O)Cn1nc(C(C)=O)c2cc(ccc12)-c1cnc(C)nc1
: