Target
Nociceptin receptor
Ligand
BDBM26975
Substrate
BDBM26957
Meas. Tech.
Receptor Binding Assay
pH
7.8±n/a
Temperature
298.15±n/a K
Ki
2.1±n/a nM
Citation
 Okano, MMito, JMaruyama, YMasuda, HNiwa, TNakagawa, SNakamura, YMatsuura, A Discovery and structure-activity relationships of 4-aminoquinazoline derivatives, a novel class of opioid receptor like-1 (ORL1) antagonists. Bioorg Med Chem 17:119-32 (2009)  
Target
Name:
Nociceptin receptor
Synonyms:
KOR-3 Mu-type opioid receptor (Mu) Nociceptin Receptor (ORL1 Receptor) Nociceptin receptor (ORL-1) Nociceptin/Orphanin FQ, NOP receptor OPIATE ORL-1 OPRL1 protein ORL1 Opioid receptor like-1 Orphanin FQ receptor (ORL1) | P41146
Type:
G Protein-Coupled Receptor (GPCR)
Mol. Mass.:
40702.87
Organism:
Homo sapiens (Human)
Description:
P41146
Residue:
370
  
Inhibitor
Name:
BDBM26975
Synonyms:
2-benzoylquinazoline analogue, (rac)-17 | N-{4-[(2-carbamimidamidocyclohexyl)amino]-6-methylquinazolin-2-yl}-4-chlorobenzamide
Type:
Small organic molecule
Emp. Form.:
C23H26ClN7O
Mol. Mass.:
451.952
SMILES:
[#6]-c1ccc2nc(-[#7]-[#6](=O)-c3ccc(Cl)cc3)nc(-[#7]-[#6]-3-[#6]-[#6]-[#6]-[#6]-[#6]-3\[#7]=[#6](/[#7])-[#7])c2c1
:
Substrate
Name:
BDBM26957
Synonyms:
[leucyl-3H]Nociceptin | leucyl-[3H]nociceptin
Type:
radiolabeled ligand
Emp. Form.:
Mol. Mass.:
SMILES:
: