Target
Botulinum neurotoxin type A2 [1-425]
Ligand
BDBM28909
Substrate
SNAP-25-based peptide substrate
Meas. Tech.
In Vitro Assessment of Peptide Substrate Cleavage by BoNTA-LC
pH
7.4±n/a
Temperature
295.15±n/a K
IC50
14500±700 nM
Citation
 Moe, STThompson, ABSmith, GMFredenburg, RAStein, RLJacobson, AR Botulinum neurotoxin serotype A inhibitors: small-molecule mercaptoacetamide analogs. Bioorg Med Chem 17:3072-9 (2009)  
Target
Name:
Botulinum neurotoxin type A2 [1-425]
Synonyms:
BXA2_CLOBJ Botulinum Neurotoxin Type A atx bonT botA
Type:
Metalloprotease
Mol. Mass.:
48687.43
Organism:
Clostridium botulinum
Description:
Recombinant C. botulinum LC/A (1-425) was expressed in E. coli.
Residue:
425
  
Inhibitor
Name:
BDBM28909
Synonyms:
2-mercaptoacetamide, 12e | N-(3-phenyl-1H-pyrazol-5-yl)-2-sulfanylacetamide
Type:
Small organic molecule
Emp. Form.:
C11H11N3OS
Mol. Mass.:
233.29
SMILES:
SCC(=O)Nc1cc(n[nH]1)-c1ccccc1
:
Substrate
Name:
SNAP-25-based peptide substrate
Synonyms:
Type:
Fluorescent peptide
Mol. Mass.:
3503.44
Organism:
Description:
Residue:
29