Target
Estrogen-related receptor gamma
Ligand
BDBM29609
Substrate
BDBM20608
Meas. Tech.
Radioligand Displacement Assay
pH
7.4±n/a
Temperature
298.15±n/a K
IC50
13.9±1.98 nM
Citation
 Matsushima, ATeramoto, TOkada, HLiu, XTokunaga, TKakuta, YShimohigashi, Y ERRgamma tethers strongly bisphenol A and 4-alpha-cumylphenol in an induced-fit manner. Biochem Biophys Res Commun 373:408-13 (2008)  
Target
Name:
Estrogen-related receptor gamma
Synonyms:
ERR gamma-2 ERR3_HUMAN ESRRG Estrogen-Related Receptor, gamma KIAA0832 Nuclear receptor subfamily 3 group B member 3
Type:
PROTEIN
Mol. Mass.:
51305.00
Organism:
Homo sapiens (Human)
Description:
ChEMBL_1501351
Residue:
458
  
Inhibitor
Name:
BDBM29609
Synonyms:
4-alpha-Cumylphenol US9688816, B
Type:
Small organic molecule
Emp. Form.:
C15H16O
Mol. Mass.:
212.2869
SMILES:
CC(C)(c1ccccc1)c1ccc(O)cc1
:
Substrate
Name:
BDBM20608
Synonyms:
4-Hydroxytamoxifen 4-[(1Z)-1-{4-[2-(dimethylamino)ethoxy]phenyl}-2-phenylbut-1-en-1-yl]phenol CHEMBL489 cid_449459
Type:
Small organic molecule
Emp. Form.:
C26H29NO2
Mol. Mass.:
387.514
SMILES:
CC\C(=C(/c1ccc(O)cc1)c1ccc(OCCN(C)C)cc1)c1ccccc1
: