Target
5'-methylthioadenosine/S-adenosylhomocysteine nucleosidase
Ligand
BDBM36436
Substrate
BDBM22111
Meas. Tech.
MTAN Inhibition Assay
pH
7.5±0
Temperature
298.15±0 K
Ki
0.208±46 nM
Citation
 Gutierrez, JACrowder, TRinaldo-Matthis, AHo, MCAlmo, SCSchramm, VL Transition state analogs of 5'-methylthioadenosine nucleosidase disrupt quorum sensing. Nat Chem Biol 5:251-7 (2009)  
Target
Name:
5'-methylthioadenosine/S-adenosylhomocysteine nucleosidase
Synonyms:
5 -methylthioadenosine nucleosidase 5'-methylthioadenosine/S-adenosylhomocysteine nucleosidase MTA/SAH nucleosidase MTNN_ECOLI P46 mtn pfs | yadA
Type:
Enzyme
Mol. Mass.:
24347.14
Organism:
Escherichia coli (strain K12)
Description:
P0AF12
Residue:
232
  
Inhibitor
Name:
BDBM36436
Synonyms:
(3R,4S)-1-[(9-Deaza-adenin-9-yl)methyl]-4-ethylthio-methyl-3-hydroxypyrrolidine, 9 CID11393519
Type:
Small organic molecule
Emp. Form.:
C16H25N5OS
Mol. Mass.:
335.468
SMILES:
CCCCSC[C@H]1CN(Cc2c[nH]c3c(N)ncnc23)C[C@@H]1O
:
Substrate
Name:
BDBM22111
Synonyms:
(2R,3R,4S,5S)-2-(6-amino-9H-purin-9-yl)-5-[(methylsulfanyl)methyl]oxolane-3,4-diol 5'-Methylthioado CHEMBL277041 | MTA
Type:
Nucleoside or nucleotide
Emp. Form.:
C11H15N5O3S
Mol. Mass.:
297.334
SMILES:
CSC[C@H]1O[C@H]([C@H](O)[C@@H]1O)n1cnc2c(N)ncnc12
: