Target
Tyrosine-protein kinase JAK2 [831-1132]
Ligand
BDBM264225
Substrate
Meas. Tech.
JAK Enzymatic Assay
pH
7.3±n/a
IC50
790±n/a nM
Comments
extracted
Citation
 Grimster, NKawatkar, SKettle, JGSu, QVasbinder, MChuaqui, CE Compounds and methods for inhibiting JAK US Patent  US9714236 Publication Date 7/25/2017 
Target
Name:
Tyrosine-protein kinase JAK2 [831-1132]
Synonyms:
JAK2 JAK2_HUMAN | Tyrosine-protein kinase JAK2 (aa 831-1132)
Type:
Enzyme Catalytic Domain
Mol. Mass.:
35337.99
Organism:
Homo sapiens (Human)
Description:
O60674[831-1132]
Residue:
302
  
Inhibitor
Name:
BDBM264225
Synonyms:
(2R)-3-methoxy-N- (3-{2-[(3-methoxy- 1-methyl-1H-pyrazol- 4-yl)amino]-5- methylpyrimidin-4-yl}- 1H-indol-7-yl)- 2-(4-methylpiperazin-1- yl)propanamide US10654835, Example 45 US9714236, 45
Type:
Small organic molecule
Emp. Form.:
C27H35N9O3
Mol. Mass.:
533.6253
SMILES:
COC[C@@H](N1CCN(C)CC1)C(=O)Nc1cccc2c(c[nH]c12)-c1nc(Nc2cn(C)nc2OC)ncc1C
: