Target
Rho-associated protein kinase 2
Ligand
BDBM14027
Substrate
Meas. Tech.
Dose-response biochemical assay of inhibitors of Rho kinase 2 (Rock2)
IC50
71±n/a nM
Citation
 PubChem, PC Dose-response biochemical assay of inhibitors of Rho kinase 2 (Rock2)  PubChem Bioassay (2007)[AID] 
Target
Name:
Rho-associated protein kinase 2
Synonyms:
KIAA0619 ROCK2 Rho kinase 2 (ROCKII) Rho-associated protein kinase 2 (ROCK2) Rho-associated protein kinase 2/Transforming protein RhoA Rho-associated, coiled-coil-containing protein kinase II p164 ROCK-2
Type:
Protein
Mol. Mass.:
160885.43
Organism:
Homo sapiens (Human)
Description:
O75116
Residue:
1388
  
Inhibitor
Name:
BDBM14027
Synonyms:
5-(1,4-diazepan-1-ylsulfonyl)isoquinoline AT877 CHEMBL541388 HA-1077 cid_163751
Type:
Small organic molecule
Emp. Form.:
C14H17N3O2S
Mol. Mass.:
291.369
SMILES:
O=S(=O)(N1CCCNCC1)c1cccc2cnccc12
: