Target
Coagulation factor XI
Ligand
BDBM32697
Substrate
Meas. Tech.
Factor XIa Dose Response Confirmation
IC50
>50000±0 nM
Citation
 PubChem, PC Factor XIa Dose Response Confirmation PubChem Bioassay (2008)[AID] 
Target
Name:
Coagulation factor XI
Synonyms:
Coagulation factor XIa Coagulation factor XIa light chain FA11_HUMAN Factor XIa PTA | Plasma thromboplastin antecedent
Type:
Enzyme
Mol. Mass.:
70130.58
Organism:
Homo sapiens (Human)
Description:
P03951
Residue:
625
  
Inhibitor
Name:
BDBM32697
Synonyms:
(3-Furan-2-yl-5-methylsulfanyl-[1,2,4]triazol-1-yl)-phenyl-methanone SMR000120487 [3-(2-furyl)-5-(methylthio)-1,2,4-triazol-1-yl]-phenyl-methanone [3-(furan-2-yl)-5-methylsulfanyl-1,2,4-triazol-1-yl]-phenylmethanone | cid_1088427
Type:
Small organic molecule
Emp. Form.:
C14H11N3O2S
Mol. Mass.:
285.321
SMILES:
CSc1nc(nn1C(=O)c1ccccc1)-c1ccco1
: