Target
Tyrosine-protein kinase JAK2
Ligand
BDBM34637
Substrate
Meas. Tech.
Luminescent counterscreen for inhibitors of the Janus kinase 2 mutant JAK2V617F: dose response cell-based high throughput screening assay for inhibitors of parental Ba/F3 cell viability.
IC50
1711±n/a nM
Citation
 PubChem, PC Luminescent counterscreen for inhibitors of the Janus kinase 2 mutant JAK2V617F: dose response cell-based high throughput screening assay for inhibitors of parental Ba/F3 cell viability. PubChem Bioassay (2009)[AID] 
Target
Name:
Tyrosine-protein kinase JAK2
Synonyms:
JAK-2 JAK2_HUMAN Janus kinase 2 (JAK2) | Janus kinase 2 (a protein tyrosine kinase)
Type:
Protein
Mol. Mass.:
130684.68
Organism:
Homo sapiens (Human)
Description:
O60674
Residue:
1132
  
Inhibitor
Name:
BDBM34637
Synonyms:
(4-methoxyphenyl)-(1-oxidospiro[benzimidazol-1-ium-2,1'-cyclohexane]-5-yl)amine N-(4-methoxyphenyl)-1-oxidanidyl-spiro[benzimidazol-1-ium-2,1'-cyclohexane]-5-amine N-(4-methoxyphenyl)-1-oxidospiro[benzimidazol-1-ium-2,1'-cyclohexane]-5-amine cid_791069
Type:
Small organic molecule
Emp. Form.:
C19H21N3O2
Mol. Mass.:
323.3889
SMILES:
COc1ccc(Nc2ccc3=[N+]([O-])C4(CCCCC4)N=c3c2)cc1
: