Target
Heat shock protein HSP 90-alpha
Ligand
BDBM47945
Substrate
Meas. Tech.
Luminescence-based dose response biochemical high throughput screening assay for inhibitors of the Heat Shock Protein 90 (HSP90)
IC50
5930±n/a nM
Citation
 PubChem, PC Luminescence-based dose response biochemical high throughput screening assay for inhibitors of the Heat Shock Protein 90 (HSP90) PubChem Bioassay (2009)[AID] 
Target
Name:
Heat shock protein HSP 90-alpha
Synonyms:
HS90A_HUMAN HSP86 HSP90AA1 HSPCA Heat shock 86 kDa Heat shock protein HSP 90-alpha (HSP90) LAP-2 Lipopolysaccharide-associated protein 2 heat shock protein 90kDa alpha (cytosolic), class A member 1 isoform 2
Type:
Molecular Chaperone
Mol. Mass.:
84623.45
Organism:
Homo sapiens (Human)
Description:
P07900
Residue:
732
  
Inhibitor
Name:
BDBM47945
Synonyms:
4-(5-amino-4-phenyl-1-pyrazolyl)benzoic acid 4-(5-amino-4-phenyl-pyrazol-1-yl)benzoic acid 4-(5-azanyl-4-phenyl-pyrazol-1-yl)benzoic acid SMR000136772 | cid_1302358
Type:
Small organic molecule
Emp. Form.:
C16H13N3O2
Mol. Mass.:
279.2933
SMILES:
Nc1c(cnn1-c1ccc(cc1)C(O)=O)-c1ccccc1
: