Target
Hexokinase HKDC1 [W721R]
Ligand
BDBM51785
Substrate
Meas. Tech.
Dose Response confirmation of inhibitors of hexokinase domain containing I (HKDC1) in the hexokinase 1 selectivity assay
IC50
80000±n/a nM
Citation
 PubChem, PC Dose Response confirmation of inhibitors of hexokinase domain containing I (HKDC1) in the hexokinase 1 selectivity assay PubChem Bioassay (2011)[AID] 
Target
Name:
Hexokinase HKDC1 [W721R]
Synonyms:
HKDC1 putative hexokinase HKDC1
Type:
Enzyme Catalytic Domain
Mol. Mass.:
102520.24
Organism:
Homo sapiens (Human)
Description:
gi_156151420
Residue:
917
  
Inhibitor
Name:
BDBM51785
Synonyms:
(5E)-1-(2,5-dimethoxyphenyl)-5-(2-furanylmethylidene)-2-sulfanylidene-1,3-diazinane-4,6-dione (5E)-1-(2,5-dimethoxyphenyl)-5-(2-furylmethylene)-2-thioxodihydropyrimidine-4,6(1H,5H)-dione MLS001197216 cid_1608674
Type:
Small organic molecule
Emp. Form.:
C17H14N2O5S
Mol. Mass.:
358.368
SMILES:
COc1ccc(OC)c(c1)N1C(=S)NC(=O)C(=Cc2ccco2)C1=O
: