Target
Toll-like receptor 9
Ligand
BDBM68048
Substrate
Meas. Tech.
Fluorescence-based cell-based high throughput dose response assay for inhibitors of TLR9-MyD88 binding
IC50
4733±n/a nM
Citation
 PubChem, PC Fluorescence-based cell-based high throughput dose response assay for inhibitors of TLR9-MyD88 binding PubChem Bioassay (2011)[AID] 
Target
Name:
Toll-like receptor 9
Synonyms:
CD_antigen: CD289 TLR9_HUMAN
Type:
Enzyme
Mol. Mass.:
115889.91
Organism:
Homo sapiens (Human)
Description:
Q9NR96
Residue:
1032
  
Inhibitor
Name:
BDBM68048
Synonyms:
(7-chloro-4-nitro-benzofurazan-5-yl)amine 7-chloranyl-4-nitro-2,1,3-benzoxadiazol-5-amine MLS000580319 cid_2735302
Type:
Small organic molecule
Emp. Form.:
C6H3ClN4O3
Mol. Mass.:
214.566
SMILES:
Nc1cc(Cl)c2nonc2c1[N+]([O-])=O
: