Target
Toll-like receptor 9
Ligand
BDBM83265
Substrate
Meas. Tech.
Fluorescence-based cell-based high throughput dose response assay for inhibitors of TLR9-MyD88 binding
IC50
4182±n/a nM
Citation
 PubChem, PC Fluorescence-based cell-based high throughput dose response assay for inhibitors of TLR9-MyD88 binding PubChem Bioassay (2011)[AID] 
Target
Name:
Toll-like receptor 9
Synonyms:
CD_antigen: CD289 TLR9_HUMAN
Type:
Enzyme
Mol. Mass.:
115889.91
Organism:
Homo sapiens (Human)
Description:
Q9NR96
Residue:
1032
  
Inhibitor
Name:
BDBM83265
Synonyms:
6-(4-benzylpiperidin-1-yl)-N-[(3-fluorophenyl)methyl]-9,10,10-trioxothioxanthene-1-carboxamide MLS002472294 N-[(3-fluorophenyl)methyl]-9,10,10-tris(oxidanylidene)-6-[4-(phenylmethyl)piperidin-1-yl]thioxanthene-1-carboxamide cid_44144211
Type:
Small organic molecule
Emp. Form.:
C33H29FN2O4S
Mol. Mass.:
568.658
SMILES:
Fc1cccc(CNC(=O)c2cccc3c2C(=O)c2ccc(cc2S3(=O)=O)N2CCC(Cc3ccccc3)CC2)c1
: