Target
5-hydroxytryptamine receptor 2A
Ligand
BDBM50395587
Substrate
Meas. Tech.
ChEMBL_1666016 (CHEMBL4015812)
Ki
2.0±n/a nM
Citation
 Männel, BDengler, DShonberg, JHübner, HMöller, DGmeiner, P Hydroxy-Substituted Heteroarylpiperazines: Novel Scaffolds for?-Arrestin-Biased D J Med Chem 60:4693-4713 (2017)  
Target
Name:
5-hydroxytryptamine receptor 2A
Synonyms:
5-HT-2 5-HT2A 5-hydroxytryptamine receptor 2A (5HT-2A) 5HT2A_HUMAN HTR2A | Serotonin receptor 2A
Type:
undefined
Mol. Mass.:
52607.65
Organism:
Homo sapiens (Human)
Description:
P28223
Residue:
471
  
Inhibitor
Name:
BDBM50395587
Synonyms:
CHEMBL2165126 US9156822, 2
Type:
Small organic molecule
Emp. Form.:
C24H29Cl2N3O2
Mol. Mass.:
462.412
SMILES:
Clc1cccc(N2CCCN(CCCCOc3ccc4CCC(=O)Nc4c3)CC2)c1Cl
: